[Bug 9966] New: util-linux-2.30/.stamp_built' failed

Previous Topic Next Topic
 
classic Classic list List threaded Threaded
5 messages Options
Reply | Threaded
Open this post in threaded view
|

[Bug 9966] New: util-linux-2.30/.stamp_built' failed

Bugzilla from bugzilla@busybox.net
https://bugs.busybox.net/show_bug.cgi?id=9966

            Bug ID: 9966
           Summary: util-linux-2.30/.stamp_built' failed
           Product: buildroot
           Version: unspecified
          Hardware: Other
                OS: Linux
            Status: NEW
          Severity: normal
          Priority: P5
         Component: Other
          Assignee: [hidden email]
          Reporter: [hidden email]
                CC: [hidden email]
  Target Milestone: ---

/home/osboxes/Desktop/boards/arm/karo/tx6u_8033/fs/buildroot/output/host/usr/lib/libncurses.so:
file not recognized: File format not recognized
collect2: error: ld returned 1 exit status
Makefile:5997: recipe for target 'dmesg' failed
make[3]: *** [dmesg] Error 1
make[3]: *** Waiting for unfinished jobs....
make[3]: Leaving directory
'/home/osboxes/Desktop/boards/arm/karo/tx6u_8033/fs/buildroot/output/build/util-linux-2.30'
Makefile:11718: recipe for target 'all-recursive' failed
make[2]: *** [all-recursive] Error 1
make[2]: Leaving directory
'/home/osboxes/Desktop/boards/arm/karo/tx6u_8033/fs/buildroot/output/build/util-linux-2.30'
Makefile:4913: recipe for target 'all' failed
make[1]: *** [all] Error 2
make[1]: Leaving directory
'/home/osboxes/Desktop/boards/arm/karo/tx6u_8033/fs/buildroot/output/build/util-linux-2.30'
package/pkg-generic.mk:227: recipe for target
'/home/osboxes/Desktop/boards/arm/karo/tx6u_8033/fs/buildroot/output/build/util-linux-2.30/.stamp_built'
failed
make: ***
[/home/osboxes/Desktop/boards/arm/karo/tx6u_8033/fs/buildroot/output/build/util-linux-2.30/.stamp_built]
Error 2


armv7 a9

--
You are receiving this mail because:
You are on the CC list for the bug.
_______________________________________________
buildroot mailing list
[hidden email]
http://lists.busybox.net/mailman/listinfo/buildroot
Reply | Threaded
Open this post in threaded view
|

[Bug 9966] util-linux-2.30/.stamp_built' failed

Bugzilla from bugzilla@busybox.net
https://bugs.busybox.net/show_bug.cgi?id=9966

Carlos Santos <[hidden email]> changed:

           What    |Removed                     |Added
----------------------------------------------------------------------------
           Assignee|[hidden email] |[hidden email]
                   |.org                        |

--
You are receiving this mail because:
You are on the CC list for the bug.
_______________________________________________
buildroot mailing list
[hidden email]
http://lists.busybox.net/mailman/listinfo/buildroot
Reply | Threaded
Open this post in threaded view
|

[Bug 9966] util-linux-2.30/.stamp_built' failed

Bugzilla from bugzilla@busybox.net
In reply to this post by Bugzilla from bugzilla@busybox.net
https://bugs.busybox.net/show_bug.cgi?id=9966

Carlos Santos <[hidden email]> changed:

           What    |Removed                     |Added
----------------------------------------------------------------------------
             Status|NEW                         |ASSIGNED

--- Comment #1 from Carlos Santos <[hidden email]> ---
Please check if the problem persists on a recent master snapshot (as of commit
74235a6854d6e469f2dbc141fe08ce9ae94e7d3c).

Please provide a copy of your defconfig. Run

    $ make savedefconfig BR2_DEFCONFIG=/tmp/bug_9966_defconfig

Then attach /tmp/bug_9966_defconfig to this bug report.

--
You are receiving this mail because:
You are on the CC list for the bug.
_______________________________________________
buildroot mailing list
[hidden email]
http://lists.busybox.net/mailman/listinfo/buildroot
Reply | Threaded
Open this post in threaded view
|

[Bug 9966] util-linux-2.30/.stamp_built' failed

Bugzilla from bugzilla@busybox.net
In reply to this post by Bugzilla from bugzilla@busybox.net
https://bugs.busybox.net/show_bug.cgi?id=9966

--- Comment #2 from Refik Tuzakli <[hidden email]> ---
After I run make clean, I run make again then it works.

--
You are receiving this mail because:
You are on the CC list for the bug.
_______________________________________________
buildroot mailing list
[hidden email]
http://lists.busybox.net/mailman/listinfo/buildroot
Reply | Threaded
Open this post in threaded view
|

[Bug 9966] util-linux-2.30/.stamp_built' failed

Bugzilla from bugzilla@busybox.net
In reply to this post by Bugzilla from bugzilla@busybox.net
https://bugs.busybox.net/show_bug.cgi?id=9966

Carlos Santos <[hidden email]> changed:

           What    |Removed                     |Added
----------------------------------------------------------------------------
         Resolution|---                         |WORKSFORME
             Status|ASSIGNED                    |RESOLVED

--- Comment #3 from Carlos Santos <[hidden email]> ---
Looks like the reporter attempted to perform a dirty build in an output
directory containing traces of a previous build, for a different architecture.

Closing as RESOLVED/WORKSFORME, since the reporter did not provide enough
information to reproduce the failure and was able to circumvent the problem by
means of a clean build.

--
You are receiving this mail because:
You are on the CC list for the bug.
_______________________________________________
buildroot mailing list
[hidden email]
http://lists.busybox.net/mailman/listinfo/buildroot